Reaction Details
TargetPlasma kallikrein
LigandBDBM50046896
Substrate/Competitorn/a
Meas. Tech.ChEMBL_92364 (CHEMBL701579)
IC50 1100±n/a nM
Citation McConnell, RMYork, JLFrizzell, DEzell, C Inhibition studies of some serine and thiol proteinases by new leupeptin analogues. J Med Chem36:1084-9 (1993) Plasma kallikrein
Name:Plasma kallikrein
Type:Protein
Mol. Mass.:71391.16
Organism:Homo sapiens (Human)
Description:P03952
Residue:638
BDBM50046896
NameBDBM50046896
Synonyms:2-Acetylamino-4-methyl-pentanoic acid [1-(1-formyl-4-guanidino-butylcarbamoyl)-2-phenyl-ethyl]-amide | CHEMBL2373053
TypeSmall organic molecule
Emp. Form.C23H36N6O4
Mol. Mass.460.5697
SMILES[#6]-[#6](-[#6])-[#6]-[#6@H](-[#7]-[#6](-[#6])=O)-[#6](=O)-[#7]-[#6@@H](-[#6]-c1ccccc1)-[#6](=O)-[#7]-[#6@@H](-[#6]-[#6]-[#6]\[#7]=[#6](\[#7])-[#7])-[#6]=O