Reaction Details
TargetProthrombin
LigandBDBM50046892
Substrate/Competitorn/a
Meas. Tech.ChEMBL_210580 (CHEMBL816531)
IC50 66000±n/a nM
Citation McConnell, RMYork, JLFrizzell, DEzell, C Inhibition studies of some serine and thiol proteinases by new leupeptin analogues. J Med Chem36:1084-9 (1993) Prothrombin
Name:Prothrombin
Type:Enzyme
Mol. Mass.:70502.73
Organism:Bos taurus (Bovine)
Description:P00735
Residue:625
BDBM50046892
NameBDBM50046892
Synonyms:2-Acetylamino-4-methyl-pentanoic acid [1-(1-formyl-4-guanidino-butylcarbamoyl)-2-(4-hydroxy-phenyl)-ethyl]-amide | CHEMBL2373064
TypeSmall organic molecule
Emp. Form.C23H36N6O5
Mol. Mass.476.5691
SMILES[#6]-[#6](-[#6])-[#6]-[#6@H](-[#7]-[#6](-[#6])=O)-[#6](=O)-[#7]-[#6@@H](-[#6]-c1ccc(-[#8])cc1)-[#6](=O)-[#7]-[#6@@H](-[#6]-[#6]-[#6]\[#7]=[#6](\[#7])-[#7])-[#6]=O