Reaction Details
TargetCathepsin B
LigandBDBM50046887
Substrate/Competitorn/a
Meas. Tech.ChEMBL_47253 (CHEMBL656659)
IC50 1500±n/a nM
Citation McConnell, RMYork, JLFrizzell, DEzell, C Inhibition studies of some serine and thiol proteinases by new leupeptin analogues. J Med Chem36:1084-9 (1993) Cathepsin B
Name:Cathepsin B
Type:Enzyme
Mol. Mass.:36657.87
Organism:Bos taurus (bovine)
Description:Bovine spleen CB was purchased from Sigma Co. (USA).
Residue:335
BDBM50046887
NameBDBM50046887
Synonyms:2-(2-Acetylamino-3-phenyl-propionylamino)-4-methyl-pentanoic acid (1-formyl-4-guanidino-butyl)-amide | CHEMBL2373060
TypeSmall organic molecule
Emp. Form.C23H36N6O4
Mol. Mass.460.5697
SMILES[#6]-[#6](-[#6])-[#6]-[#6@H](-[#7]-[#6](=O)-[#6@H](-[#6]-c1ccccc1)-[#7]-[#6](-[#6])=O)-[#6](=O)-[#7]-[#6@@H](-[#6]-[#6]-[#6]\[#7]=[#6](\[#7])-[#7])-[#6]=O