Reaction Details
TargetPolyunsaturated fatty acid 5-lipoxygenase
LigandBDBM50046902
Substrate/Competitorn/a
Meas. Tech.ChEMBL_4176 (CHEMBL619242)
IC50 1200±n/a nM
Citation Mullican, MDWilson, MWConnor, DTKostlan, CRSchrier, DJDyer, RD Design of 5-(3,5-di-tert-butyl-4-hydroxyphenyl)-1,3,4-thiadiazoles, -1,3,4-oxadiazoles, and -1,2,4-triazoles as orally-active, nonulcerogenic antiinflammatory agents. J Med Chem36:1090-9 (1993) Polyunsaturated fatty acid 5-lipoxygenase
Name:Polyunsaturated fatty acid 5-lipoxygenase
Type:PROTEIN
Mol. Mass.:78082.31
Organism:Rattus norvegicus
Description:ChEMBL_1432947
Residue:673
BDBM50046902
NameBDBM50046902
Synonyms:2,6-Di-tert-butyl-4-(5-methylsulfanyl-[1,3,4]thiadiazol-2-yl)-phenol | CHEMBL12532
TypeSmall organic molecule
Emp. Form.C17H24N2OS2
Mol. Mass.336.515
SMILESCSc1nnc(s1)-c1cc(c(O)c(c1)C(C)(C)C)C(C)(C)C