Reaction Details
TargetPolyunsaturated fatty acid 5-lipoxygenase
LigandBDBM22971
Substrate/Competitorn/a
Meas. Tech.ChEMBL_4176 (CHEMBL619242)
IC50 24000±n/a nM
Citation Mullican, MDWilson, MWConnor, DTKostlan, CRSchrier, DJDyer, RD Design of 5-(3,5-di-tert-butyl-4-hydroxyphenyl)-1,3,4-thiadiazoles, -1,3,4-oxadiazoles, and -1,2,4-triazoles as orally-active, nonulcerogenic antiinflammatory agents. J Med Chem36:1090-9 (1993) Polyunsaturated fatty acid 5-lipoxygenase
Name:Polyunsaturated fatty acid 5-lipoxygenase
Type:PROTEIN
Mol. Mass.:78082.31
Organism:Rattus norvegicus
Description:ChEMBL_1432947
Residue:673
BDBM22971
NameBDBM22971
Synonyms:2-[(2,6-dichloro-3-methylphenyl)amino]benzoic acid Meclofenamate US11337935, Compound Meclofenamic-acid | US20240002326, Compound Meclofenamic acid
TypeSmall organic molecule
Emp. Form.C14H11Cl2NO2
Mol. Mass.296.149
SMILESCc1ccc(Cl)c(Nc2ccccc2C(O)=O)c1Cl