Reaction Details
TargetKappa-type opioid receptor
LigandBDBM50038641
Substrate/Competitorn/a
Meas. Tech.ChEMBL_146370 (CHEMBL759290)
Ki 33±n/a nM
Citation Portoghese, PSOhkawa, SMoe, STTakemori, AE Synthesis and delta-opioid receptor antagonist activity of a naltrindole analogue with a regioisomeric indole moiety. J Med Chem37:1886-8 (1994) Kappa-type opioid receptor
Name:Kappa-type opioid receptor
Type:G Protein-Coupled Receptor (GPCR)
Mol. Mass.:42744.99
Organism:Cavia porcellus (domestic guinea pig)
Description:P41144
Residue:380
BDBM50038641
NameBDBM50038641
Synonyms:22-cyclopropylmethyl-(2R,13S)-14-oxa-4,22-diazaheptacyclo[13.9.1.01,13.02,21.03,11.05,10.019,25]pentacosa-3(11),5(10),6,8,15,17,19(25)-heptaen-16-ol | CHEMBL418105
TypeSmall organic molecule
Emp. Form.C26H26N2O2
Mol. Mass.398.4968
SMILESOc1ccc2C[C@@H]3[C@@H]4c5[nH]c6ccccc6c5C[C@@H]5Oc1c2[C@]45CCN3CC1CC1