Reaction Details
TargetDelta-type opioid receptor
LigandBDBM50038641
Substrate/Competitorn/a
Meas. Tech.ChEMBL_145764 (CHEMBL752782)
IC50 8200±n/a nM
Citation Portoghese, PSOhkawa, SMoe, STTakemori, AE Synthesis and delta-opioid receptor antagonist activity of a naltrindole analogue with a regioisomeric indole moiety. J Med Chem37:1886-8 (1994) Delta-type opioid receptor
Name:Delta-type opioid receptor
Type:Enzyme Catalytic Domain
Mol. Mass.:40577.25
Organism:MOUSE
Description:P32300
Residue:372
BDBM50038641
NameBDBM50038641
Synonyms:22-cyclopropylmethyl-(2R,13S)-14-oxa-4,22-diazaheptacyclo[13.9.1.01,13.02,21.03,11.05,10.019,25]pentacosa-3(11),5(10),6,8,15,17,19(25)-heptaen-16-ol | CHEMBL418105
TypeSmall organic molecule
Emp. Form.C26H26N2O2
Mol. Mass.398.4968
SMILESOc1ccc2C[C@@H]3[C@@H]4c5[nH]c6ccccc6c5C[C@@H]5Oc1c2[C@]45CCN3CC1CC1