Reaction Details
TargetSigma non-opioid intracellular receptor 1
LigandBDBM50038706
Substrate/Competitorn/a
Meas. Tech.ChEMBL_200981 (CHEMBL801234)
Ki 0.61±n/a nM
Citation Hudkins, RLMailman, RBDeHaven-Hudkins, DL Novel (4-phenylpiperidinyl)- and (4-phenylpiperazinyl)alkyl-spaced esters of 1-phenylcyclopentanecarboxylic acids as potent sigma-selective compounds. J Med Chem37:1964-70 (1994) Sigma non-opioid intracellular receptor 1
Name:Sigma non-opioid intracellular receptor 1
Type:Enzyme Catalytic Domain
Mol. Mass.:25124.85
Organism:Homo sapiens (Human)
Description:Q99720
Residue:223
BDBM50038706
NameBDBM50038706
Synonyms:1-Phenyl-cyclopentanecarboxylic acid 5-(4-phenyl-piperidin-1-yl)-pentyl ester; hydrochloride | CHEMBL542380
TypeSmall organic molecule
Emp. Form.C28H37NO2
Mol. Mass.419.5989
SMILESO=C(OCCCCCN1CCC(CC1)c1ccccc1)C1(CCCC1)c1ccccc1