Reaction Details
TargetSigma non-opioid intracellular receptor 1
LigandBDBM50038714
Substrate/Competitorn/a
Meas. Tech.ChEMBL_200981 (CHEMBL801234)
Ki 0.88±n/a nM
Citation Hudkins, RLMailman, RBDeHaven-Hudkins, DL Novel (4-phenylpiperidinyl)- and (4-phenylpiperazinyl)alkyl-spaced esters of 1-phenylcyclopentanecarboxylic acids as potent sigma-selective compounds. J Med Chem37:1964-70 (1994) Sigma non-opioid intracellular receptor 1
Name:Sigma non-opioid intracellular receptor 1
Type:Enzyme Catalytic Domain
Mol. Mass.:25124.85
Organism:Homo sapiens (Human)
Description:Q99720
Residue:223
BDBM50038714
NameBDBM50038714
Synonyms:1-(4-Iodo-phenyl)-cyclopentanecarboxylic acid 3-(4-phenyl-piperidin-1-yl)-propyl ester; hydrochloride | CHEMBL556409
TypeSmall organic molecule
Emp. Form.C26H32INO2
Mol. Mass.517.4422
SMILESIc1ccc(cc1)C1(CCCC1)C(=O)OCCCN1CCC(CC1)c1ccccc1