Reaction Details
TargetSigma non-opioid intracellular receptor 1
LigandBDBM50366613
Substrate/Competitorn/a
Meas. Tech.ChEMBL_201098 (CHEMBL807413)
Ki 5070±n/a nM
Citation Hudkins, RLMailman, RBDeHaven-Hudkins, DL Novel (4-phenylpiperidinyl)- and (4-phenylpiperazinyl)alkyl-spaced esters of 1-phenylcyclopentanecarboxylic acids as potent sigma-selective compounds. J Med Chem37:1964-70 (1994) Sigma non-opioid intracellular receptor 1
Name:Sigma non-opioid intracellular receptor 1
Type:Enzyme Catalytic Domain
Mol. Mass.:25266.54
Organism:RAT
Description:Q9R0C9
Residue:223
BDBM50366613
NameBDBM50366613
Synonyms:DEXTROMETHORPHAN
TypeSmall organic molecule
Emp. Form.C18H25NO
Mol. Mass.271.3972
SMILESCOc1ccc2C[C@H]3[C@H]4CCCC[C@@]4(CCN3C)c2c1