Reaction Details
TargetPlatelet-activating factor receptor
LigandBDBM50038762
Substrate/Competitorn/a
Meas. Tech.ChEMBL_151699 (CHEMBL760448)
Ki 6.5±n/a nM
Citation Sheppard, GSPireh, DCarrera, GMBures, MGHeyman, HRSteinman, DHDavidsen, SKPhillips, JGGuinn, DEMay, PD 3-(2-(3-Pyridinyl)thiazolidin-4-oyl)indoles, a novel series of platelet activating factor antagonists. J Med Chem37:2011-32 (1994) Platelet-activating factor receptor
Name:Platelet-activating factor receptor
Type:Protein
Mol. Mass.:39005.63
Organism:Cavia porcellus
Description:n/a
Residue:342
BDBM50038762
NameBDBM50038762
Synonyms:(7-Methyl-1H-indol-3-yl)-((R)-2-pyridin-3-yl-thiazolidin-4-yl)-methanone | CHEMBL62219
TypeSmall organic molecule
Emp. Form.C18H17N3OS
Mol. Mass.323.412
SMILESCc1cccc2c(c[nH]c12)C(=O)[C@@H]1CSC(N1)c1cccnc1