Reaction Details
TargetPlatelet-activating factor receptor
LigandBDBM50000714
Substrate/Competitorn/a
Meas. Tech.ChEMBL_151699 (CHEMBL760448)
Ki 98±n/a nM
Citation Sheppard, GSPireh, DCarrera, GMBures, MGHeyman, HRSteinman, DHDavidsen, SKPhillips, JGGuinn, DEMay, PD 3-(2-(3-Pyridinyl)thiazolidin-4-oyl)indoles, a novel series of platelet activating factor antagonists. J Med Chem37:2011-32 (1994) Platelet-activating factor receptor
Name:Platelet-activating factor receptor
Type:Protein
Mol. Mass.:39005.63
Organism:Cavia porcellus
Description:n/a
Residue:342
BDBM50000714
NameBDBM50000714
Synonyms:3-[4-(2-Chloro-phenyl)-9-methyl-6H-1-thia-5,7,8,9a-tetraaza-cyclopenta[e]azulen-2-yl]-1-morpholin-4-yl-propan-1-one 3-[4-(2-Chloro-phenyl)-9-methyl-6H-1-thia-5,7,8,9a-tetraaza-cyclopenta[e]azulen-2-yl]-1-morpholin-4-yl-propan-1-one(WEB2086) CHEMBL280164 | WEB2086
TypeSmall organic molecule
Emp. Form.C22H22ClN5O2S
Mol. Mass.455.96
SMILESCc1nnc2CN=C(c3cc(CCC(=O)N4CCOCC4)sc3-n12)c1ccccc1Cl