Reaction Details
TargetSubstance-P receptor
LigandBDBM50030179
Substrate/Competitorn/a
Meas. Tech.ChEMBL_205806 (CHEMBL882133)
IC50 4.9±n/a nM
Citation Hagiwara, DMiyake, HIgari, NKarino, MMaeda, YFujii, TMatsuo, M Studies on neurokinin antagonists. 4. Synthesis and structure-activity relationships of novel dipeptide substance P antagonists: N2-[(4R)-4-hydroxy-1-[(1-methyl-1H-indol-3-yl)carbonyl]-L-prolyl]-N- methyl-N-(phenylmethyl)-3-(2-naphthyl)-L-alaninamide and its related compounds. J Med Chem37:2090-9 (1994) Substance-P receptor
Name:Substance-P receptor
Type:Enzyme Catalytic Domain
Mol. Mass.:46261.42
Organism:GUINEA PIG
Description:Neurokinin NK1 TACR1 GUINEA PIG::P30547
Residue:407
BDBM50030179
NameBDBM50030179
Synonyms:(R)-4-Hydroxy-1-(1-methyl-1H-indole-3-carbonyl)-pyrrolidine-2-carboxylic acid [(R)-1-(benzyl-methyl-carbamoyl)-2-(4-trifluoromethyl-phenyl)-ethyl]-amide | CHEMBL305548
TypeSmall organic molecule
Emp. Form.C33H33F3N4O4
Mol. Mass.606.6347
SMILESCN(Cc1ccccc1)C(=O)[C@@H](Cc1ccc(cc1)C(F)(F)F)NC(=O)C1C[C@@H](O)CN1C(=O)c1cn(C)c2ccccc12