Reaction Details
TargetSubstance-P receptor
LigandBDBM50030182
Substrate/Competitorn/a
Meas. Tech.ChEMBL_205786 (CHEMBL812414)
IC50 3.5±n/a nM
Citation Hagiwara, DMiyake, HIgari, NKarino, MMaeda, YFujii, TMatsuo, M Studies on neurokinin antagonists. 4. Synthesis and structure-activity relationships of novel dipeptide substance P antagonists: N2-[(4R)-4-hydroxy-1-[(1-methyl-1H-indol-3-yl)carbonyl]-L-prolyl]-N- methyl-N-(phenylmethyl)-3-(2-naphthyl)-L-alaninamide and its related compounds. J Med Chem37:2090-9 (1994) Substance-P receptor
Name:Substance-P receptor
Type:Enzyme Catalytic Domain
Mol. Mass.:46261.42
Organism:GUINEA PIG
Description:Neurokinin NK1 TACR1 GUINEA PIG::P30547
Residue:407
BDBM50030182
NameBDBM50030182
Synonyms:(R)-4-Hydroxy-1-(1-methyl-1H-indole-3-carbonyl)-pyrrolidine-2-carboxylic acid [(R)-1-(benzyl-methyl-carbamoyl)-2-(1-formyl-1H-indol-3-yl)-ethyl]-amide | CHEMBL292715
TypeSmall organic molecule
Emp. Form.C35H35N5O5
Mol. Mass.605.6829
SMILESCN(Cc1ccccc1)C(=O)[C@@H](Cc1cn(C=O)c2ccccc12)NC(=O)C1C[C@@H](O)CN1C(=O)c1cn(C)c2ccccc12