Reaction Details
Target3-oxo-5-alpha-steroid 4-dehydrogenase 2
LigandBDBM50039323
Substrate/Competitorn/a
Meas. Tech.ChEMBL_202883 (CHEMBL810001)
IC50 3.9±n/a nM
Citation Frye, SVHaffner, CDMaloney, PRMook, RADorsey, GFHiner, RNCribbs, CMWheeler, TNRay, JAAndrews, RC 6-Azasteroids: structure-activity relationships for inhibition of type 1 and 2 human 5 alpha-reductase and human adrenal 3 beta-hydroxy-delta 5-steroid dehydrogenase/3-keto-delta 5-steroid isomerase. J Med Chem37:2352-60 (1994) 3-oxo-5-alpha-steroid 4-dehydrogenase 2
Name:3-oxo-5-alpha-steroid 4-dehydrogenase 2
Type:Enzyme
Mol. Mass.:28406.59
Organism:Homo sapiens (Human)
Description:P31213
Residue:254
BDBM50039323
NameBDBM50039323
Synonyms:(1S,9aR,11aS)-6,9a,11a-Trimethyl-7-oxo-2,3,3a,3b,4,5,7,8,9,9a,9b,10,11,11a-tetradecahydro-1H-cyclopenta[i]phenanthridine-1-carboxylic acid diethylamide | CHEMBL77765
TypeSmall organic molecule
Emp. Form.C24H38N2O2
Mol. Mass.386.5707
SMILESCCN(CC)C(=O)[C@H]1CCC2C3CN=C4C(C)C(=O)CC[C@]4(C)C3CC[C@]12C