Reaction Details
TargetMu-type opioid receptor
LigandBDBM29568
Substrate/Competitorn/a
Meas. Tech.ChEMBL_138892 (CHEMBL747884)
Ki 0.20±n/a nM
Citation Zuckermann, RNMartin, EJSpellmeyer, DCStauber, GBShoemaker, KRKerr, JMFigliozzi, GMGoff, DASiani, MASimon, RJ Discovery of nanomolar ligands for 7-transmembrane G-protein-coupled receptors from a diverse N-(substituted)glycine peptoid library. J Med Chem37:2678-85 (1994) Mu-type opioid receptor
Name:Mu-type opioid receptor
Type:G Protein-Coupled Receptor (GPCR)
Mol. Mass.:44503.11
Organism:Rattus norvegicus (rat)
Description:Competition binding assays were carried out using membrane preparations from transfected HN9.10 cells that constitutively expressed the mu opioid receptor.
Residue:398
BDBM29568
NameBDBM29568
Synonyms:CHEMBL2 PRAZOSIN HYDROCHLORIDE [3H]-Minipress [3H]-Prazosin
Typeradiolabeled ligand
Emp. Form.C19H21N5O4
Mol. Mass.383.4011
SMILESCOc1cc2nc(nc(N)c2cc1OC)N1CCN(CC1)C(=O)c1ccco1