Reaction Details
TargetMu-type opioid receptor
LigandBDBM50007344
Substrate/Competitorn/a
Meas. Tech.ChEMBL_138726 (CHEMBL872342)
IC50 150±n/a nM
Citation Weerawarna, SADavis, RDNelson, WL Isothiocyanate-substituted kappa-selective opioid receptor ligands derived from N-methyl-N-[(1S)-1-phenyl-2-(1-pyrrolidinyl)ethyl] phenylacetamide. J Med Chem37:2856-64 (1994) Mu-type opioid receptor
Name:Mu-type opioid receptor
Type:Enzyme Catalytic Domain
Mol. Mass.:11165.58
Organism:GUINEA PIG
Description:P97266
Residue:98
BDBM50007344
NameBDBM50007344
Synonyms:(S)-2-(3,4-Dichloro-phenyl)-N-methyl-N-(1-phenyl-2-pyrrolidin-1-yl-ethyl)-acetamide(ICI 199441) 2-(3,4-Dichloro-phenyl)-N-methyl-N-((S)-1-phenyl-2-pyrrolidin-1-yl-ethyl)-acetamide CHEMBL38576 | ICI-199441
TypeSmall organic molecule
Emp. Form.C21H24Cl2N2O
Mol. Mass.391.334
SMILESCN([C@H](CN1CCCC1)c1ccccc1)C(=O)Cc1ccc(Cl)c(Cl)c1