Reaction Details
TargetCarbonic anhydrase 2
LigandBDBM50043905
Substrate/Competitorn/a
Meas. Tech.ChEMBL_45049 (CHEMBL658047)
Ki 11±n/a nM
Citation Hunt, CAMallorga, PJMichelson, SRSchwam, HSondey, JMSmith, RLSugrue, MFShepard, KL 3-substituted thieno[2,3-b][1,4]thiazine-6-sulfonamides. A novel class of topically active carbonic anhydrase inhibitors. J Med Chem37:240-7 (1994) Carbonic anhydrase 2
Name:Carbonic anhydrase 2
Type:Enzyme
Mol. Mass.:29250.71
Organism:Homo sapiens (Human)
Description:P00918
Residue:260
BDBM50043905
NameBDBM50043905
Synonyms:CHEMBL79368 | N-Isobutyl-2-(2-oxo-6-sulfamoyl-2,3-dihydro-1H-thieno[2,3-b][1,4]thiazin-3-yl)-acetamide
TypeSmall organic molecule
Emp. Form.C8H10N2O4S3
Mol. Mass.294.371
SMILESNS(=O)(=O)c1cc2NCC3(CC3)S(=O)(=O)c2s1