Reaction Details
TargetAdenosine receptor A2a
LigandBDBM50453442
Substrate/Competitorn/a
Meas. Tech.ChEMBL_31068 (CHEMBL640428)
Ki 172±n/a nM
Citation Kim, HOJi, XDSiddiqi, SMOlah, MEStiles, GLJacobson, KA 2-Substitution of N6-benzyladenosine-5'-uronamides enhances selectivity for A3 adenosine receptors. J Med Chem37:3614-21 (1994) Adenosine receptor A2a
Name:Adenosine receptor A2a
Type:G Protein-Coupled Receptor (GPCR)
Mol. Mass.:45015.65
Organism:Rattus norvegicus (rat)
Description:Rat A2A receptors expressed in CHO cells.
Residue:410
BDBM50453442
NameBDBM50453442
Synonyms:CHEMBL1256714
TypeSmall organic molecule
Emp. Form.C18H22N6O4
Mol. Mass.386.4051
SMILESNc1ccc(CCNc2ncnc3n(cnc23)[C@@H]2O[C@H](CO)[C@@H](O)[C@H]2O)cc1