Reaction Details
TargetAdenosine receptor A1
LigandBDBM50407234
Substrate/Competitorn/a
Meas. Tech.ChEMBL_29642 (CHEMBL639749)
Ki 2140±n/a nM
Citation Kim, HOJi, XDSiddiqi, SMOlah, MEStiles, GLJacobson, KA 2-Substitution of N6-benzyladenosine-5'-uronamides enhances selectivity for A3 adenosine receptors. J Med Chem37:3614-21 (1994) Adenosine receptor A1
Name:Adenosine receptor A1
Type:Protein
Mol. Mass.:36704.13
Organism:Rattus norvegicus (rat)
Description:n/a
Residue:326
BDBM50407234
NameBDBM50407234
Synonyms:CHEMBL2113557
TypeSmall organic molecule
Emp. Form.C19H21IN6O4S
Mol. Mass.556.377
SMILESCNC(=O)[C@H]1O[C@H]([C@H](O)[C@@H]1O)n1cnc2c(NCc3cccc(I)c3)nc(SC)nc12