Reaction Details
TargetAdenosine receptor A3
LigandBDBM50453443
Substrate/Competitorn/a
Meas. Tech.ChEMBL_30614 (CHEMBL642021)
Ki 3.1±n/a nM
Citation Kim, HOJi, XDSiddiqi, SMOlah, MEStiles, GLJacobson, KA 2-Substitution of N6-benzyladenosine-5'-uronamides enhances selectivity for A3 adenosine receptors. J Med Chem37:3614-21 (1994) Adenosine receptor A3
Name:Adenosine receptor A3
Type:PROTEIN
Mol. Mass.:36643.73
Organism:Rattus norvegicus
Description:ChEMBL_479910
Residue:320
BDBM50453443
NameBDBM50453443
Synonyms:CHEMBL2113562
TypeSmall organic molecule
Emp. Form.C19H22IN7O4
Mol. Mass.539.327
SMILESCNC(=O)[C@H]1O[C@H]([C@H](O)[C@@H]1O)n1cnc2c(NCc3cccc(I)c3)nc(NC)nc12