Reaction Details
TargetAdenosine receptor A2a
LigandBDBM50407234
Substrate/Competitorn/a
Meas. Tech.ChEMBL_31068 (CHEMBL640428)
Ki 3210±n/a nM
Citation Kim, HOJi, XDSiddiqi, SMOlah, MEStiles, GLJacobson, KA 2-Substitution of N6-benzyladenosine-5'-uronamides enhances selectivity for A3 adenosine receptors. J Med Chem37:3614-21 (1994) Adenosine receptor A2a
Name:Adenosine receptor A2a
Type:G Protein-Coupled Receptor (GPCR)
Mol. Mass.:45015.65
Organism:Rattus norvegicus (rat)
Description:Rat A2A receptors expressed in CHO cells.
Residue:410
BDBM50407234
NameBDBM50407234
Synonyms:CHEMBL2113557
TypeSmall organic molecule
Emp. Form.C19H21IN6O4S
Mol. Mass.556.377
SMILESCNC(=O)[C@H]1O[C@H]([C@H](O)[C@@H]1O)n1cnc2c(NCc3cccc(I)c3)nc(SC)nc12