Reaction Details
TargetEquilibrative nucleoside transporter 1
LigandBDBM50407234
Substrate/Competitorn/a
Meas. Tech.ChEMBL_181682 (CHEMBL786456)
Ki 49500±n/a nM
Citation Kim, HOJi, XDSiddiqi, SMOlah, MEStiles, GLJacobson, KA 2-Substitution of N6-benzyladenosine-5'-uronamides enhances selectivity for A3 adenosine receptors. J Med Chem37:3614-21 (1994) Equilibrative nucleoside transporter 1
Name:Equilibrative nucleoside transporter 1
Type:PROTEIN
Mol. Mass.:50023.68
Organism:Rattus norvegicus
Description:ChEMBL_181682
Residue:457
BDBM50407234
NameBDBM50407234
Synonyms:CHEMBL2113557
TypeSmall organic molecule
Emp. Form.C19H21IN6O4S
Mol. Mass.556.377
SMILESCNC(=O)[C@H]1O[C@H]([C@H](O)[C@@H]1O)n1cnc2c(NCc3cccc(I)c3)nc(SC)nc12