Reaction Details
Target3-oxo-5-alpha-steroid 4-dehydrogenase 1
LigandBDBM50037932
Substrate/Competitorn/a
Meas. Tech.ChEMBL_205213 (CHEMBL816487)
IC50 5±n/a nM
Citation Bakshi, RKPatel, GFRasmusson, GHBaginsky, WFCimis, GEllsworth, KChang, BBull, HTolman, RLHarris, GS 4,7 beta-Dimethyl-4-azacholestan-3-one (MK-386) and related 4-azasteroids as selective inhibitors of human type 1 5 alpha-reductase. J Med Chem37:3871-4 (1994) 3-oxo-5-alpha-steroid 4-dehydrogenase 1
Name:3-oxo-5-alpha-steroid 4-dehydrogenase 1
Type:Enzyme
Mol. Mass.:29472.80
Organism:Homo sapiens (Human)
Description:P18405
Residue:259
BDBM50037932
NameBDBM50037932
Synonyms:(4aR,6aR)-7-(1,5-Dimethyl-hexyl)-4a,6a-dimethyl-1,4a,4b,5,6,6a,7,8,9,9a,9b,10,11,11a-tetradecahydro-indeno[5,4-f]quinolin-2-one | CHEMBL338207
TypeSmall organic molecule
Emp. Form.C26H43NO
Mol. Mass.385.6257
SMILESCC(C)CCCC(C)C1CCC2C3CCC4NC(=O)C=C[C@]4(C)C3CC[C@]12C