Reaction Details
Target3-oxo-5-alpha-steroid 4-dehydrogenase 1
LigandBDBM50037922
Substrate/Competitorn/a
Meas. Tech.ChEMBL_205213 (CHEMBL816487)
IC50 3.3±n/a nM
Citation Bakshi, RKPatel, GFRasmusson, GHBaginsky, WFCimis, GEllsworth, KChang, BBull, HTolman, RLHarris, GS 4,7 beta-Dimethyl-4-azacholestan-3-one (MK-386) and related 4-azasteroids as selective inhibitors of human type 1 5 alpha-reductase. J Med Chem37:3871-4 (1994) 3-oxo-5-alpha-steroid 4-dehydrogenase 1
Name:3-oxo-5-alpha-steroid 4-dehydrogenase 1
Type:Enzyme
Mol. Mass.:29472.80
Organism:Homo sapiens (Human)
Description:P18405
Residue:259
BDBM50037922
NameBDBM50037922
Synonyms:(4aR,6aR,10S)-7-(1,5-Dimethyl-hexyl)-1-ethyl-4a,6a,10-trimethyl-hexadecahydro-indeno[5,4-f]quinolin-2-one | CHEMBL340305
TypeSmall organic molecule
Emp. Form.C29H51NO
Mol. Mass.429.7213
SMILESCCN1C2C[C@H](C)C3C4CCC(C(C)CCCC(C)C)[C@@]4(C)CCC3[C@@]2(C)CCC1=O