Reaction Details
TargetSigma non-opioid intracellular receptor 1
LigandBDBM50036772
Substrate/Competitorn/a
Meas. Tech.ChEMBL_201742 (CHEMBL809876)
Ki 1.9±n/a nM
Citation Gilligan, PJKergaye, AALewis, BMMcElroy, JF Piperidinyltetralin sigma ligands. J Med Chem37:364-70 (1994) Sigma non-opioid intracellular receptor 1
Name:Sigma non-opioid intracellular receptor 1
Type:Enzyme Catalytic Domain
Mol. Mass.:25124.85
Organism:Homo sapiens (Human)
Description:Q99720
Residue:223
BDBM50036772
NameBDBM50036772
Synonyms:1'-(4-nitrobenzyl)spiro[1,2,3,4-tetrahydronaphthalene-2,4'-(hexahydropyridine)]-1-one; hydrochloride | CHEMBL544123
TypeSmall organic molecule
Emp. Form.C21H22N2O3
Mol. Mass.350.411
SMILES[O-][N+](=O)c1ccc(CN2CCC3(CC2)CCc2ccccc2C3=O)cc1