Reaction Details
TargetNeprilysin
LigandBDBM50040405
Substrate/Competitorn/a
Meas. Tech.ChEMBL_144598 (CHEMBL747373)
IC50 4±n/a nM
Citation De Lombaert, SErion, MDTan, JBlanchard, Lel-Chehabi, LGhai, RDSakane, YBerry, CTrapani, AJ N-Phosphonomethyl dipeptides and their phosphonate prodrugs, a new generation of neutral endopeptidase (NEP, EC 3.4.24.11) inhibitors. J Med Chem37:498-511 (1994) Neprilysin
Name:Neprilysin
Type:Protein
Mol. Mass.:85789.59
Organism:Rattus norvegicus (Rat)
Description:P07861
Residue:750
BDBM50040405
NameBDBM50040405
Synonyms:3-[3-Biphenyl-4-yl-2-(phosphonomethyl-amino)-propionylamino]-propionic acid | CHEMBL148521
TypeSmall organic molecule
Emp. Form.C19H23N2O6P
Mol. Mass.406.3695
SMILESOC(=O)CCNC(=O)C(Cc1ccc(cc1)-c1ccccc1)NCP(O)(O)=O