Reaction Details
TargetDelta-type opioid receptor
LigandBDBM50040482
Substrate/Competitorn/a
Meas. Tech.ChEMBL_145084 (CHEMBL753309)
Ki 15±n/a nM
Citation Portoghese, PSSultana, MMoe, STTakemori, AE Synthesis of naltrexone-derived delta-opioid antagonists. Role of conformation of the delta address moiety. J Med Chem37:579-85 (1994) Delta-type opioid receptor
Name:Delta-type opioid receptor
Type:G Protein-Coupled Receptor (GPCR)
Mol. Mass.:40382.98
Organism:Homo sapiens (Human)
Description:Competition binding assays were carried out using membrane preparations from transfected HN9.10 cells that constitutively expressed the delta opioid receptor.
Residue:372
BDBM50040482
NameBDBM50040482
Synonyms:17-(cyclopropylmethyl)-6,7-didehydro-4,5-alpha-epoxy-3,14-dihydroxy-6-(1'-spirobenzodioxalanyl)morphinan
TypeSmall organic molecule
Emp. Form.C26H27NO5
Mol. Mass.433.4963
SMILESOc1ccc2CC3N(CC4CC4)CC[C@@]45[C@@H](Oc1c24)C1(CC[C@@]35O)Oc2ccccc2O1