Reaction Details
TargetKappa-type opioid receptor
LigandBDBM50040487
Substrate/Competitorn/a
Meas. Tech.ChEMBL_145989 (CHEMBL750583)
Ki 13±n/a nM
Citation Portoghese, PSSultana, MMoe, STTakemori, AE Synthesis of naltrexone-derived delta-opioid antagonists. Role of conformation of the delta address moiety. J Med Chem37:579-85 (1994) Kappa-type opioid receptor
Name:Kappa-type opioid receptor
Type:G Protein-Coupled Receptor (GPCR)
Mol. Mass.:42744.99
Organism:Cavia porcellus (domestic guinea pig)
Description:P41144
Residue:380
BDBM50040487
NameBDBM50040487
Synonyms:17-(cyclopropylmethyl)4,5-alpha-epoxy-3,14-dihydroxymorphinan-6-one-7-spiro-2'-indan
TypeSmall organic molecule
Emp. Form.C28H29NO4
Mol. Mass.443.5342
SMILESOc1ccc2CC3N(CC4CC4)CC[C@@]45[C@@H](Oc1c24)C(=O)C1(Cc2ccccc2C1)C[C@@]35O