Reaction Details
TargetAdenosine receptor A1
LigandBDBM50106543
Substrate/Competitorn/a
Meas. Tech.ChEMBL_29150 (CHEMBL639430)
Ki 18±n/a nM
Citation Gallo-Rodriguez, CJi, XDMelman, NSiegman, BDSanders, LHOrlina, JFischer, BPu, QOlah, MEvan Galen, PJ Structure-activity relationships of N6-benzyladenosine-5'-uronamides as A3-selective adenosine agonists. J Med Chem37:636-46 (1994) Adenosine receptor A1
Name:Adenosine receptor A1
Type:Protein
Mol. Mass.:36704.13
Organism:Rattus norvegicus (rat)
Description:n/a
Residue:326
BDBM50106543
NameBDBM50106543
Synonyms:5-[6-(4-Amino-3-iodo-benzylamino)-purin-9-yl]-3,4-dihydroxy-tetrahydro-furan-2-carboxylic acid methylamide IAB-MECA
TypeSmall organic molecule
Emp. Form.C18H20IN7O4
Mol. Mass.525.3004
SMILESCNC(=O)[C@H]1O[C@H]([C@H](O)[C@@H]1O)n1cnc2c(NCc3ccc(N)c(I)c3)ncnc12