Reaction Details
TargetAdenosine receptor A1
LigandBDBM21220
Substrate/Competitorn/a
Meas. Tech.ChEMBL_29150 (CHEMBL639430)
Ki 6.3±n/a nM
Citation Gallo-Rodriguez, CJi, XDMelman, NSiegman, BDSanders, LHOrlina, JFischer, BPu, QOlah, MEvan Galen, PJ Structure-activity relationships of N6-benzyladenosine-5'-uronamides as A3-selective adenosine agonists. J Med Chem37:636-46 (1994) Adenosine receptor A1
Name:Adenosine receptor A1
Type:Protein
Mol. Mass.:36704.13
Organism:Rattus norvegicus (rat)
Description:n/a
Residue:326
BDBM21220
NameBDBM21220
Synonyms:(2S,3S,4R,5R)-5-(6-amino-9H-purin-9-yl)-N-ethyl-3,4-dihydroxyoxolane-2-carboxamide Adenosine, N6-Ethyl-carboxamido CHEMBL464859 NECA
TypeAntineoplastic Agent
Emp. Form.C12H16N6O4
Mol. Mass.308.2932
SMILESCCNC(=O)[C@H]1O[C@H]([C@H](O)[C@@H]1O)n1cnc2c(N)ncnc12