Reaction Details
TargetAlpha-2C adrenergic receptor
LigandBDBM50366618
Substrate/Competitorn/a
Meas. Tech.ChEMBL_33522 (CHEMBL648614)
Ki 370±n/a nM
Citation Wetzel, JMMiao, SWForray, CBorden, LABranchek, TAGluchowski, C Discovery of alpha 1a-adrenergic receptor antagonists based on the L-type Ca2+ channel antagonist niguldipine. J Med Chem38:1579-81 (1995) Alpha-2C adrenergic receptor
Name:Alpha-2C adrenergic receptor
Type:Enzyme
Mol. Mass.:49552.32
Organism:Homo sapiens (Human)
Description:P18825
Residue:462
BDBM50366618
NameBDBM50366618
Synonyms:CHEMBL448620 | SNAP-5089
TypeSmall organic molecule
Emp. Form.C36H40N4O5
Mol. Mass.608.7266
SMILESCOC(=O)C1C(C(C(=O)NCCCN2CCC(CC2)(c2ccccc2)c2ccccc2)=C(C)N=C1C)c1ccc(cc1)[N+]([O-])=O