Reaction Details
TargetAdenosine receptor A3
LigandBDBM50453671
Substrate/Competitorn/a
Meas. Tech.ChEMBL_30616 (CHEMBL642023)
Ki 12±n/a nM
Citation Jacobson, KASiddiqi, SMOlah, MEJi, XDMelman, NBellamkonda, KMeshulam, YStiles, GLKim, HO Structure-activity relationships of 9-alkyladenine and ribose-modified adenosine derivatives at rat A3 adenosine receptors. J Med Chem38:1720-35 (1995) Adenosine receptor A3
Name:Adenosine receptor A3
Type:PROTEIN
Mol. Mass.:36643.73
Organism:Rattus norvegicus
Description:ChEMBL_479910
Residue:320
BDBM50453671
NameBDBM50453671
Synonyms:CHEMBL2113701
TypeSmall organic molecule
Emp. Form.C19H16ClIN6O4S
Mol. Mass.586.791
SMILES[H][C@]12OC(=S)O[C@@]1([H])[C@@H](O[C@@H]2C(=O)NC)n1cnc2c(NCc3cccc(I)c3)nc(Cl)nc12