Reaction Details
TargetD(2) dopamine receptor
LigandBDBM50002238
Substrate/Competitorn/a
Meas. Tech.ChEMBL_61760 (CHEMBL670522)
IC50 8400±n/a nM
Citation Perregaard, JMoltzen, EKMeier, ESánchez, C Sigma ligands with subnanomolar affinity and preference for the sigma 2 binding site. 1. 3-(omega-aminoalkyl)-1H-indoles. J Med Chem38:1998-2008 (1995) D(2) dopamine receptor
Name:D(2) dopamine receptor
Type:G Protein-Coupled Receptor (GPCR)
Mol. Mass.:50931.60
Organism:Rattus norvegicus (rat)
Description:P61169
Residue:444
BDBM50002238
NameBDBM50002238
Synonyms:(R)1-(4-Fluoro-phenyl)-4-[4-(5-fluoro-pyrimidin-2-yl)-piperazin-1-yl]-butan-1-ol 1-(4-Fluoro-phenyl)-1-[4-(5-fluoro-pyrimidin-2-yl)-piperazin-1-yl]-butan-1-ol(BMY-14802) 1-(4-Fluoro-phenyl)-4-[4-(5-fluoro-pyrimidin-2-yl)-piperazin-1-yl]-butan-1-ol 1-(4-fluorophenyl)-4-(4-(5-fluoropyrimidin-2-yl)piperazin-1-yl)butan-1-ol 4-{4-[5-Fluoro-2-(4-fluoro-phenyl)-2H-pyrimidin-1-yl]-piperazin-1-yl}-butan-1-ol(BMY 14802) CHEMBL60859
TypeSmall organic molecule
Emp. Form.C18H22F2N4O
Mol. Mass.348.3903
SMILESOC(CCCN1CCN(CC1)c1ncc(F)cn1)c1ccc(F)cc1