Reaction Details
TargetNeprilysin
LigandBDBM50035246
Substrate/Competitorn/a
Meas. Tech.ChEMBL_144457 (CHEMBL755104)
IC50 0.070000±n/a nM
Citation Bihovsky, RLevinson, BLLoewi, RCErhardt, PWPolokoff, MA Hydroxamic acids as potent inhibitors of endothelin-converting enzyme from human bronchiolar smooth muscle. J Med Chem38:2119-29 (1995) Neprilysin
Name:Neprilysin
Type:Enzyme
Mol. Mass.:85570.75
Organism:Oryctolagus cuniculus (rabbit)
Description:NEP was purified to homogeneity from rabbit kidney.
Residue:750
BDBM50035246
NameBDBM50035246
Synonyms:2-(2-Hydroxycarbamoyl-4-methyl-pentanoylamino)-3-(1H-indol-3-yl)-propionic acid | CHEMBL303159
TypeSmall organic molecule
Emp. Form.C18H23N3O5
Mol. Mass.361.3923
SMILESCC(C)CC(C(=O)NO)C(=O)NC(Cc1c[nH]c2ccccc12)C(O)=O