Reaction Details
TargetThermolysin
LigandBDBM50035235
Substrate/Competitorn/a
Meas. Tech.ChEMBL_210393 (CHEMBL814123)
IC50 175±n/a nM
Citation Bihovsky, RLevinson, BLLoewi, RCErhardt, PWPolokoff, MA Hydroxamic acids as potent inhibitors of endothelin-converting enzyme from human bronchiolar smooth muscle. J Med Chem38:2119-29 (1995) Thermolysin
Name:Thermolysin
Type:PROTEIN
Mol. Mass.:60097.54
Organism:Bacillus thermoproteolyticus
Description:ChEMBL_1468794
Residue:548
BDBM50035235
NameBDBM50035235
Synonyms:CHEMBL2372437 | N-[1-(Carbamoylmethyl-carbamoyl)-ethyl]-N''-hydroxy-2-isobutyl-malonamide
TypeSmall organic molecule
Emp. Form.C12H22N4O5
Mol. Mass.302.3269
SMILESCC(C)C[C@H](C(=O)NO)C(=O)N[C@@H](C)C(=O)NCC(N)=O