Reaction Details
TargetNeprilysin
LigandBDBM50035247
Substrate/Competitorn/a
Meas. Tech.ChEMBL_144456 (CHEMBL755103)
IC50 0.400000±n/a nM
Citation Bihovsky, RLevinson, BLLoewi, RCErhardt, PWPolokoff, MA Hydroxamic acids as potent inhibitors of endothelin-converting enzyme from human bronchiolar smooth muscle. J Med Chem38:2119-29 (1995) Neprilysin
Name:Neprilysin
Type:Enzyme
Mol. Mass.:85570.75
Organism:Oryctolagus cuniculus (rabbit)
Description:NEP was purified to homogeneity from rabbit kidney.
Residue:750
BDBM50035247
NameBDBM50035247
Synonyms:2-(2-Hydroxycarbamoyl-3-methyl-butyrylamino)-3-(1H-indol-3-yl)-propionic acid | CHEMBL66967
TypeSmall organic molecule
Emp. Form.C17H21N3O5
Mol. Mass.347.3657
SMILESCC(C)C(C(=O)NO)C(=O)NC(Cc1c[nH]c2ccccc12)C(O)=O