Reaction Details
TargetNeprilysin
LigandBDBM50035239
Substrate/Competitorn/a
Meas. Tech.ChEMBL_144456 (CHEMBL755103)
IC50 2±n/a nM
Citation Bihovsky, RLevinson, BLLoewi, RCErhardt, PWPolokoff, MA Hydroxamic acids as potent inhibitors of endothelin-converting enzyme from human bronchiolar smooth muscle. J Med Chem38:2119-29 (1995) Neprilysin
Name:Neprilysin
Type:Enzyme
Mol. Mass.:85570.75
Organism:Oryctolagus cuniculus (rabbit)
Description:NEP was purified to homogeneity from rabbit kidney.
Residue:750
BDBM50035239
NameBDBM50035239
Synonyms:CHEMBL63317 | N-[1-Carbamoyl-2-(1H-indol-3-yl)-ethyl]-N'-hydroxy-2-isopropyl-malonamide
TypeSmall organic molecule
Emp. Form.C17H22N4O4
Mol. Mass.346.381
SMILESCC(C)C(C(=O)NO)C(=O)NC(Cc1c[nH]c2ccccc12)C(N)=O