Reaction Details
Target3-oxo-5-alpha-steroid 4-dehydrogenase 1
LigandBDBM50368906
Substrate/Competitorn/a
Meas. Tech.ChEMBL_204756 (CHEMBL882394)
IC50 0.90±n/a nM
Citation Bakshi, RKRasmusson, GHPatel, GFMosley, RTChang, BEllsworth, KHarris, GSTolman, RL 4-Aza-3-oxo-5 alpha-androst-1-ene-17 beta-N-aryl-carboxamides as dual inhibitors of human type 1 and type 2 steroid 5 alpha-reductases. Dramatic effect of N-aryl substituents on type 1 and type 2 5 alpha-reductase inhibitory potency. J Med Chem38:3189-92 (1995) 3-oxo-5-alpha-steroid 4-dehydrogenase 1
Name:3-oxo-5-alpha-steroid 4-dehydrogenase 1
Type:Enzyme
Mol. Mass.:29472.80
Organism:Homo sapiens (Human)
Description:P18405
Residue:259
BDBM50368906
NameBDBM50368906
Synonyms:CHEMBL25448 | MK-386
TypeSmall organic molecule
Emp. Form.C28H49NO
Mol. Mass.415.6948
SMILESCC(C)CCCC(C)[C@H]1CCC2C3[C@@H](C)CC4N(C)C(=O)CC[C@]4(C)C3CC[C@]12C