Reaction Details
Target3-oxo-5-alpha-steroid 4-dehydrogenase 1
LigandBDBM50032786
Substrate/Competitorn/a
Meas. Tech.ChEMBL_204756 (CHEMBL882394)
IC50 17±n/a nM
Citation Bakshi, RKRasmusson, GHPatel, GFMosley, RTChang, BEllsworth, KHarris, GSTolman, RL 4-Aza-3-oxo-5 alpha-androst-1-ene-17 beta-N-aryl-carboxamides as dual inhibitors of human type 1 and type 2 steroid 5 alpha-reductases. Dramatic effect of N-aryl substituents on type 1 and type 2 5 alpha-reductase inhibitory potency. J Med Chem38:3189-92 (1995) 3-oxo-5-alpha-steroid 4-dehydrogenase 1
Name:3-oxo-5-alpha-steroid 4-dehydrogenase 1
Type:Enzyme
Mol. Mass.:29472.80
Organism:Homo sapiens (Human)
Description:P18405
Residue:259
BDBM50032786
NameBDBM50032786
Synonyms:(4aR,6aS)-4a,6a-Dimethyl-2-oxo-2,4a,4b,5,6,6a,7,8,9,9a,9b,10,11,11a-tetradecahydro-1H-indeno[5,4-f]quinoline-7-carboxylic acid naphthalen-2-ylamide | CHEMBL107719
TypeSmall organic molecule
Emp. Form.C29H34N2O2
Mol. Mass.442.5925
SMILESC[C@]12CCC3C(CCC4NC(=O)C=C[C@]34C)C1CCC2C(=O)Nc1ccc2ccccc2c1