Reaction Details
TargetAdenosine receptor A2a
LigandBDBM50453795
Substrate/Competitorn/a
Meas. Tech.ChEMBL_30896 (CHEMBL645500)
EC50 728±n/a nM
Citation Viziano, MOngini, EConti, AZocchi, CSeminati, MPocar, D 2-[N'-(3-arylallylidene)hydrazino]adenosines showing A2a adenosine agonist properties and vasodilation activity. J Med Chem38:3581-5 (1995) Adenosine receptor A2a
Name:Adenosine receptor A2a
Type:G Protein-Coupled Receptor (GPCR)
Mol. Mass.:45015.65
Organism:Rattus norvegicus (rat)
Description:Rat A2A receptors expressed in CHO cells.
Residue:410
BDBM50453795
NameBDBM50453795
Synonyms:CHEMBL2113553
TypeSmall organic molecule
Emp. Form.C21H26N8O4
Mol. Mass.454.4823
SMILESCN(C)c1ccc(\C=C\C=N\Nc2nc(N)c3ncn([C@@H]4O[C@H](CO)[C@@H](O)[C@H]4O)c3n2)cc1