Reaction Details
TargetAdenosine receptor A2a
LigandBDBM50453788
Substrate/Competitorn/a
Meas. Tech.ChEMBL_30896 (CHEMBL645500)
EC50 638±n/a nM
Citation Viziano, MOngini, EConti, AZocchi, CSeminati, MPocar, D 2-[N'-(3-arylallylidene)hydrazino]adenosines showing A2a adenosine agonist properties and vasodilation activity. J Med Chem38:3581-5 (1995) Adenosine receptor A2a
Name:Adenosine receptor A2a
Type:G Protein-Coupled Receptor (GPCR)
Mol. Mass.:45015.65
Organism:Rattus norvegicus (rat)
Description:Rat A2A receptors expressed in CHO cells.
Residue:410
BDBM50453788
NameBDBM50453788
Synonyms:CHEMBL2113558
TypeSmall organic molecule
Emp. Form.C19H20N8O6
Mol. Mass.456.4121
SMILESNc1nc(N\N=C\C=C\c2ccccc2[N+]([O-])=O)nc2n(cnc12)[C@@H]1O[C@H](CO)[C@@H](O)[C@H]1O