Reaction Details
Target5-hydroxytryptamine receptor 1D
LigandBDBM50033447
Substrate/Competitorn/a
Meas. Tech.ChEMBL_2009 (CHEMBL617304)
Ki 2.1±n/a nM
Citation Perez, MFourrier, CSigogneau, IPauwels, PJPalmier, CJohn, GWValentin, JPHalazy, S Synthesis and serotonergic activity of arylpiperazide derivatives of serotonin: potent agonists for 5-HT1D receptors. J Med Chem38:3602-7 (1995) 5-hydroxytryptamine receptor 1D
Name:5-hydroxytryptamine receptor 1D
Type:G Protein-Coupled Receptor (GPCR)
Mol. Mass.:41920.63
Organism:Homo sapiens (Human)
Description:Receptor binding assays were performed using human clone stably expressed in CHO cells.
Residue:377
BDBM50033447
NameBDBM50033447
Synonyms:2-[3-(2-Amino-ethyl)-1H-indol-5-yloxy]-1-(4-o-tolyl-piperazin-1-yl)-ethanone CHEMBL321818
TypeSmall organic molecule
Emp. Form.C23H28N4O2
Mol. Mass.392.494
SMILESCc1ccccc1N1CCN(CC1)C(=O)COc1ccc2[nH]cc(CCN)c2c1