Reaction Details
Target5-hydroxytryptamine receptor 1D
LigandBDBM50033445
Substrate/Competitorn/a
Meas. Tech.ChEMBL_2009 (CHEMBL617304)
Ki 0.34±n/a nM
Citation Perez, MFourrier, CSigogneau, IPauwels, PJPalmier, CJohn, GWValentin, JPHalazy, S Synthesis and serotonergic activity of arylpiperazide derivatives of serotonin: potent agonists for 5-HT1D receptors. J Med Chem38:3602-7 (1995) 5-hydroxytryptamine receptor 1D
Name:5-hydroxytryptamine receptor 1D
Type:G Protein-Coupled Receptor (GPCR)
Mol. Mass.:41920.63
Organism:Homo sapiens (Human)
Description:Receptor binding assays were performed using human clone stably expressed in CHO cells.
Residue:377
BDBM50033445
NameBDBM50033445
Synonyms:6-[3-(2-Amino-ethyl)-1H-indol-5-yloxy]-1-[4-(4-nitro-phenyl)-piperazin-1-yl]-hexan-1-one | CHEMBL121207
TypeSmall organic molecule
Emp. Form.C26H33N5O4
Mol. Mass.479.5713
SMILESNCCc1c[nH]c2ccc(OCCCCCC(=O)N3CCN(CC3)c3ccc(cc3)[N+]([O-])=O)cc12