Reaction Details
Target5-hydroxytryptamine receptor 1D
LigandBDBM50033434
Substrate/Competitorn/a
Meas. Tech.ChEMBL_2035 (CHEMBL616869)
Ki 0.39±n/a nM
Citation Perez, MFourrier, CSigogneau, IPauwels, PJPalmier, CJohn, GWValentin, JPHalazy, S Synthesis and serotonergic activity of arylpiperazide derivatives of serotonin: potent agonists for 5-HT1D receptors. J Med Chem38:3602-7 (1995) 5-hydroxytryptamine receptor 1D
Name:5-hydroxytryptamine receptor 1D
Type:G Protein-Coupled Receptor (GPCR)
Mol. Mass.:41920.63
Organism:Homo sapiens (Human)
Description:Receptor binding assays were performed using human clone stably expressed in CHO cells.
Residue:377
BDBM50033434
NameBDBM50033434
Synonyms:2-(4-{2-[3-(2-Amino-ethyl)-1H-indol-5-yloxy]-acetyl}-piperazin-1-yl)-benzonitrile | CHEMBL119927
TypeSmall organic molecule
Emp. Form.C23H25N5O2
Mol. Mass.403.4769
SMILESNCCc1c[nH]c2ccc(OCC(=O)N3CCN(CC3)c3ccccc3C#N)cc12