Reaction Details
TargetAlpha-2B adrenergic receptor
LigandBDBM50453799
Substrate/Competitorn/a
Meas. Tech.ChEMBL_33355 (CHEMBL644759)
Ki>5000±n/a nM
Citation Ruffolo, RRBondinell, WHieble, JP Alpha- and beta-adrenoceptors: from the gene to the clinic. 2. Structure-activity relationships and therapeutic applications. J Med Chem38:3681-716 (1995) Alpha-2B adrenergic receptor
Name:Alpha-2B adrenergic receptor
Type:Enzyme
Mol. Mass.:49964.20
Organism:Homo sapiens (Human)
Description:P18089
Residue:450
BDBM50453799
NameBDBM50453799
Synonyms:Niguldipine
TypeSmall organic molecule
Emp. Form.C36H39N3O6
Mol. Mass.609.7114
SMILESCOC(=O)C1=C(C)NC(C)=C([C@H]1c1cccc(c1)[N+]([O-])=O)C(=O)OCCCN1CCC(CC1)(c1ccccc1)c1ccccc1