Reaction Details
TargetAlpha-1D adrenergic receptor
LigandBDBM50030615
Substrate/Competitorn/a
Meas. Tech.ChEMBL_32443 (CHEMBL646104)
Ki 1.2±n/a nM
Citation Ruffolo, RRBondinell, WHieble, JP Alpha- and beta-adrenoceptors: from the gene to the clinic. 2. Structure-activity relationships and therapeutic applications. J Med Chem38:3681-716 (1995) Alpha-1D adrenergic receptor
Name:Alpha-1D adrenergic receptor
Type:Enzyme Catalytic Domain
Mol. Mass.:60485.82
Organism:Homo sapiens (Human)
Description:adrenergic Alpha1D ADRA1D HUMAN::P25100
Residue:572
BDBM50030615
NameBDBM50030615
Synonyms:5-Chloro-1-ethyl-8-methyl-6,7,8,9-tetrahydro-2-thia-8-aza-benzo[cd]azulene SK&F-106686 | SK-106686
TypeSmall organic molecule
Emp. Form.C14H16ClNS
Mol. Mass.265.802
SMILESCCc1sc2ccc(Cl)c3CCN(C)Cc1c23