Reaction Details
TargetAlpha-2C adrenergic receptor
LigandBDBM50030615
Substrate/Competitorn/a
Meas. Tech.ChEMBL_33532 (CHEMBL648623)
Ki 35±n/a nM
Citation Ruffolo, RRBondinell, WHieble, JP Alpha- and beta-adrenoceptors: from the gene to the clinic. 2. Structure-activity relationships and therapeutic applications. J Med Chem38:3681-716 (1995) Alpha-2C adrenergic receptor
Name:Alpha-2C adrenergic receptor
Type:Enzyme
Mol. Mass.:49552.32
Organism:Homo sapiens (Human)
Description:P18825
Residue:462
BDBM50030615
NameBDBM50030615
Synonyms:5-Chloro-1-ethyl-8-methyl-6,7,8,9-tetrahydro-2-thia-8-aza-benzo[cd]azulene SK&F-106686 | SK-106686
TypeSmall organic molecule
Emp. Form.C14H16ClNS
Mol. Mass.265.802
SMILESCCc1sc2ccc(Cl)c3CCN(C)Cc1c23