Reaction Details
TargetAlpha-1A adrenergic receptor
LigandBDBM50030615
Substrate/Competitorn/a
Meas. Tech.ChEMBL_33729 (CHEMBL647045)
Ki 58±n/a nM
Citation Ruffolo, RRBondinell, WHieble, JP Alpha- and beta-adrenoceptors: from the gene to the clinic. 2. Structure-activity relationships and therapeutic applications. J Med Chem38:3681-716 (1995) Alpha-1A adrenergic receptor
Name:Alpha-1A adrenergic receptor
Type:Cell-surface receptors
Mol. Mass.:51511.67
Organism:Homo sapiens (Human)
Description:P35348
Residue:466
BDBM50030615
NameBDBM50030615
Synonyms:5-Chloro-1-ethyl-8-methyl-6,7,8,9-tetrahydro-2-thia-8-aza-benzo[cd]azulene SK&F-106686 | SK-106686
TypeSmall organic molecule
Emp. Form.C14H16ClNS
Mol. Mass.265.802
SMILESCCc1sc2ccc(Cl)c3CCN(C)Cc1c23