Reaction Details
TargetAdenosine deaminase
LigandBDBM50031254
Substrate/Competitorn/a
Meas. Tech.ChEMBL_30794 (CHEMBL645070)
Ki>100000±n/a nM
Citation Cristalli, GVittori, SEleuteri, AVolpini, RCamaioni, ELupidi, GMahmood, NBevilacqua, FPalù, G Synthesis and biological evaluation of N6-cycloalkyl derivatives of 1-deazaadenine nucleosides: a new class of anti-human immunodeficiency virus agents. J Med Chem38:4019-25 (1995) Adenosine deaminase
Name:Adenosine deaminase
Type:Enzyme
Mol. Mass.:40910.44
Organism:Bos taurus (bovine)
Description:n/a
Residue:363
BDBM50031254
NameBDBM50031254
Synonyms:CHEMBL275433 | [5-(7-Amino-5-chloro-imidazo[4,5-b]pyridin-3-yl)-tetrahydro-furan-2-yl]-methanol
TypeSmall organic molecule
Emp. Form.C11H13ClN4O2
Mol. Mass.268.7
SMILESNc1cc(Cl)nc2n(cnc12)C1CCC(CO)O1